{"text_format":"1","workbook":"xlsx","n_sheets":3,"sheets":["Summary","Mileage","Dropdown"],"not_rendered":{"charts":0,"images":1,"macros":1,"external_links":0,"defined_names":5,"comments":0,"pivot_tables":0},"unopened":[],"bounds":{"document_bytes":16777216,"sheet_cells":100000,"rows_first":2000,"rows_last":500,"rows_between":2000,"halvings":0,"cell_chars":16384,"cell_head_chars":4096},"cells_cut":0,"cells_raw":0,"read":"whole","date_system":"1900"}

{"sheet":"Summary","index":0,"n_rows":24,"n_cols":7,"rows_kept":24,"cut":false,"hidden":false,"merged":[[14,13,15,14],[3,3,3,5],[4,3,4,5],[7,3,7,5],[15,4,15,5],[5,3,5,5],[13,3,13,5],[14,3,14,5],[6,3,6,5],[16,4,16,5],[0,9,0,10],[3,1,3,2],[4,1,4,2],[5,1,5,2],[7,1,7,2],[0,3,0,5]]}
[null,null,null,"TRAV-207\nSummary for Mileage Reimbursement"]
[]
[]
[null,"Employee Name"]
[null,"Title"]
[null,"Official Station / Dept."]
[null,"Home Address"]
[null,"License Number"]
[]
[]
[]
[]
[]
[]
[null,null,null,"Travel Dates"]
[null,null,null,"Period beginning"]
[null,null,null,"Period ending"]
[]
[null,null,null,"Rate Per Mile",0.42]
[null,null,null,"Total Mileage",{"$f":"SUM(Mileage!L10:L302)","v":0}]
[null,null,null,"Total Reimbursement",{"$f":"SUM(Mileage!M10:M211)","v":0}]
[]
[null,"Driving Tag","Cost Center","REEport (AES Only)","Expense Item Classification","Mileage","Expense"]
[null,null,null,null," ",null,0]

{"sheet":"Mileage","index":1,"n_rows":302,"n_cols":13,"rows_kept":302,"cut":false,"hidden":false,"merged":[[2,1,2,2],[3,1,3,2],[4,1,4,2],[7,3,7,4],[6,3,6,6],[0,10,0,11],[0,3,0,8],[2,5,2,6],[3,5,3,6],[4,5,4,6],[2,3,2,4],[3,3,3,4],[4,3,4,4]]}
[null,null,null,"Mileage Reimbursement Log",null,null,null,null,null,null,"TRAV-207"]
[]
[null,"Employee Name",null,{"$f":"IF(Summary!$D4=\"\",\"\",Summary!$D4)","v":""},null,"Rate Per Mile",null,0.42]
[null,"Official Station/Dept",null,{"$f":"IF(Summary!$D6=\"\",\"\",Summary!$D6)","v":""},null,"Total Mileage",null,{"$f":"SUM(L10:L302)","v":0}]
[null,"Period Ending",null,{"$f":"IF(Summary!$E17=\"\",\"\",Summary!$E17)","v":""},null,"Total Reimbursement",null,{"$f":"SUM(M10:M302)","v":0}]
[]
[null,null,null,"Expense Label: \nTraining/Conference = Your attendance at a training or conference event as a participant.  \nIf you host or conduct training for others, please choose Official Business"]
[null,null,null,null,null,null,null,"."]
["Date","Driving Tag","Cost Center","REEport (AES Only)","Expense Label","Expense Item Classification","Purpose of Trip","From Location","Departure Time","To Location","Arrival Time","Mileage","Expense"]
[null,null,null,null,null,{"$f":"(IF(Mileage[[#This Row],[Expense Label]]=\"Official Business\",\"Mileage - Official Business\",IF(Mileage[[#This Row],[Expense Label]]=\"Training/Conference\",\"Mileage - Private Vehicle\",IF(ISBLANK(E10),\" \",))))","v":" "},null,null,null,null,null,null,{"$f":"SUM(Mileage[[#This Row],[Mileage]]*H3)","v":0}]
[null,null,null,null,null,{"$f":"(IF(Mileage[[#This Row],[Expense Label]]=\"Official Business\",\"Mileage - Official Business\",IF(Mileage[[#This Row],[Expense Label]]=\"Training/Conference\",\"Mileage - Private Vehicle\",IF(ISBLANK(E11),\" \",))))","v":" "},null,null,null,null,null,null,{"$f":"SUM(Mileage[[#This Row],[Mileage]]*H3)","v":0}]
[null,null,null,null,null,{"$f":"(IF(Mileage[[#This Row],[Expense Label]]=\"Official Business\",\"Mileage - Official Business\",IF(Mileage[[#This Row],[Expense Label]]=\"Training/Conference\",\"Mileage - Private Vehicle\",IF(ISBLANK(E12),\" \",))))","v":" "},null,null,null,null,null,null,{"$f":"SUM(Mileage[[#This Row],[Mileage]]*H3)","v":0}]
[null,null,null,null,null,{"$f":"(IF(Mileage[[#This Row],[Expense Label]]=\"Official Business\",\"Mileage - Official Business\",IF(Mileage[[#This Row],[Expense Label]]=\"Training/Conference\",\"Mileage - Private Vehicle\",IF(ISBLANK(E13),\" \",))))","v":" "},null,null,null,null,null,null,{"$f":"SUM(Mileage[[#This Row],[Mileage]]*H3)","v":0}]
[null,null,null,null,null,{"$f":"(IF(Mileage[[#This Row],[Expense Label]]=\"Official Business\",\"Mileage - Official Business\",IF(Mileage[[#This Row],[Expense Label]]=\"Training/Conference\",\"Mileage - Private Vehicle\",IF(ISBLANK(E14),\" \",))))","v":" "},null,null,null,null,null,null,{"$f":"SUM(Mileage[[#This Row],[Mileage]]*H3)","v":0}]
[null,null,null,null,null,{"$f":"(IF(Mileage[[#This Row],[Expense Label]]=\"Official Business\",\"Mileage - Official Business\",IF(Mileage[[#This Row],[Expense Label]]=\"Training/Conference\",\"Mileage - Private Vehicle\",IF(ISBLANK(E15),\" \",))))","v":" "},null,null,null,null,null,null,{"$f":"SUM(Mileage[[#This Row],[Mileage]]*H3)","v":0}]
[null,null,null,null,null,{"$f":"(IF(Mileage[[#This Row],[Expense Label]]=\"Official Business\",\"Mileage - Official Business\",IF(Mileage[[#This Row],[Expense Label]]=\"Training/Conference\",\"Mileage - Private Vehicle\",IF(ISBLANK(E16),\" \",))))","v":" "},null,null,null,null,null,null,{"$f":"SUM(Mileage[[#This Row],[Mileage]]*H3)","v":0}]
[null,null,null,null,null,{"$f":"(IF(Mileage[[#This Row],[Expense Label]]=\"Official Business\",\"Mileage - Official Business\",IF(Mileage[[#This Row],[Expense Label]]=\"Training/Conference\",\"Mileage - Private Vehicle\",IF(ISBLANK(E17),\" \",))))","v":" "},null,null,null,null,null,null,{"$f":"SUM(Mileage[[#This Row],[Mileage]]*H3)","v":0}]
[null,null,null,null,null,{"$f":"(IF(Mileage[[#This Row],[Expense Label]]=\"Official Business\",\"Mileage - Official Business\",IF(Mileage[[#This Row],[Expense Label]]=\"Training/Conference\",\"Mileage - Private Vehicle\",IF(ISBLANK(E18),\" \",))))","v":" "},null,null,null,null,null,null,{"$f":"SUM(Mileage[[#This Row],[Mileage]]*H3)","v":0}]
[null,null,null,null,null,{"$f":"(IF(Mileage[[#This Row],[Expense Label]]=\"Official Business\",\"Mileage - Official Business\",IF(Mileage[[#This Row],[Expense Label]]=\"Training/Conference\",\"Mileage - Private Vehicle\",IF(ISBLANK(E19),\" \",))))","v":" "},null,null,null,null,null,null,{"$f":"SUM(Mileage[[#This Row],[Mileage]]*H3)","v":0}]
[null,null,null,null,null,{"$f":"(IF(Mileage[[#This Row],[Expense Label]]=\"Official Business\",\"Mileage - Official Business\",IF(Mileage[[#This Row],[Expense Label]]=\"Training/Conference\",\"Mileage - Private Vehicle\",IF(ISBLANK(E20),\" \",))))","v":" "},null,null,null,null,null,null,{"$f":"SUM(Mileage[[#This Row],[Mileage]]*H3)","v":0}]
[null,null,null,null,null,{"$f":"(IF(Mileage[[#This Row],[Expense Label]]=\"Official Business\",\"Mileage - Official Business\",IF(Mileage[[#This Row],[Expense Label]]=\"Training/Conference\",\"Mileage - Private Vehicle\",IF(ISBLANK(E21),\" \",))))","v":" "},null,null,null,null,null,null,{"$f":"SUM(Mileage[[#This Row],[Mileage]]*H3)","v":0}]
[null,null,null,null,null,{"$f":"(IF(Mileage[[#This Row],[Expense Label]]=\"Official Business\",\"Mileage - Official Business\",IF(Mileage[[#This Row],[Expense Label]]=\"Training/Conference\",\"Mileage - Private Vehicle\",IF(ISBLANK(E22),\" \",))))","v":" "},null,null,null,null,null,null,{"$f":"SUM(Mileage[[#This Row],[Mileage]]*H3)","v":0}]
[null,null,null,null,null,{"$f":"(IF(Mileage[[#This Row],[Expense Label]]=\"Official Business\",\"Mileage - Official Business\",IF(Mileage[[#This Row],[Expense Label]]=\"Training/Conference\",\"Mileage - Private Vehicle\",IF(ISBLANK(E23),\" \",))))","v":" "},null,null,null,null,null,null,{"$f":"SUM(Mileage[[#This Row],[Mileage]]*H3)","v":0}]
[null,null,null,null,null,{"$f":"(IF(Mileage[[#This Row],[Expense Label]]=\"Official Business\",\"Mileage - Official Business\",IF(Mileage[[#This Row],[Expense Label]]=\"Training/Conference\",\"Mileage - Private Vehicle\",IF(ISBLANK(E24),\" \",))))","v":" "},null,null,null,null,null,null,{"$f":"SUM(Mileage[[#This Row],[Mileage]]*H3)","v":0}]
[null,null,null,null,null,{"$f":"(IF(Mileage[[#This Row],[Expense Label]]=\"Official Business\",\"Mileage - Official Business\",IF(Mileage[[#This Row],[Expense Label]]=\"Training/Conference\",\"Mileage - Private Vehicle\",IF(ISBLANK(E25),\" \",))))","v":" "},null,null,null,null,null,null,{"$f":"SUM(Mileage[[#This Row],[Mileage]]*H3)","v":0}]
[null,null,null,null,null,{"$f":"(IF(Mileage[[#This Row],[Expense Label]]=\"Official Business\",\"Mileage - Official Business\",IF(Mileage[[#This Row],[Expense Label]]=\"Training/Conference\",\"Mileage - Private Vehicle\",IF(ISBLANK(E26),\" \",))))","v":" "},null,null,null,null,null,null,{"$f":"SUM(Mileage[[#This Row],[Mileage]]*H3)","v":0}]
[null,null,null,null,null,{"$f":"(IF(Mileage[[#This Row],[Expense Label]]=\"Official Business\",\"Mileage - Official Business\",IF(Mileage[[#This Row],[Expense Label]]=\"Training/Conference\",\"Mileage - Private Vehicle\",IF(ISBLANK(E27),\" \",))))","v":" "},null,null,null,null,null,null,{"$f":"SUM(Mileage[[#This Row],[Mileage]]*H3)","v":0}]
[null,null,null,null,null,{"$f":"(IF(Mileage[[#This Row],[Expense Label]]=\"Official Business\",\"Mileage - Official Business\",IF(Mileage[[#This Row],[Expense Label]]=\"Training/Conference\",\"Mileage - Private Vehicle\",IF(ISBLANK(E28),\" \",))))","v":" "},null,null,null,null,null,null,{"$f":"SUM(Mileage[[#This Row],[Mileage]]*H3)","v":0}]
[null,null,null,null,null,{"$f":"(IF(Mileage[[#This Row],[Expense Label]]=\"Official Business\",\"Mileage - Official Business\",IF(Mileage[[#This Row],[Expense Label]]=\"Training/Conference\",\"Mileage - Private Vehicle\",IF(ISBLANK(E29),\" \",))))","v":" "},null,null,null,null,null,null,{"$f":"SUM(Mileage[[#This Row],[Mileage]]*H3)","v":0}]
[null,null,null,null,null,{"$f":"(IF(Mileage[[#This Row],[Expense Label]]=\"Official Business\",\"Mileage - Official Business\",IF(Mileage[[#This Row],[Expense Label]]=\"Training/Conference\",\"Mileage - Private Vehicle\",IF(ISBLANK(E30),\" \",))))","v":" "},null,null,null,null,null,null,{"$f":"SUM(Mileage[[#This Row],[Mileage]]*H3)","v":0}]
[null,null,null,null,null,{"$f":"(IF(Mileage[[#This Row],[Expense Label]]=\"Official Business\",\"Mileage - Official Business\",IF(Mileage[[#This Row],[Expense Label]]=\"Training/Conference\",\"Mileage - Private Vehicle\",IF(ISBLANK(E31),\" \",))))","v":" "},null,null,null,null,null,null,{"$f":"SUM(Mileage[[#This Row],[Mileage]]*H3)","v":0}]
[null,null,null,null,null,{"$f":"(IF(Mileage[[#This Row],[Expense Label]]=\"Official Business\",\"Mileage - Official Business\",IF(Mileage[[#This Row],[Expense Label]]=\"Training/Conference\",\"Mileage - Private Vehicle\",IF(ISBLANK(E32),\" \",))))","v":" "},null,null,null,null,null,null,{"$f":"SUM(Mileage[[#This Row],[Mileage]]*H3)","v":0}]
[null,null,null,null,null,{"$f":"(IF(Mileage[[#This Row],[Expense Label]]=\"Official Business\",\"Mileage - Official Business\",IF(Mileage[[#This Row],[Expense Label]]=\"Training/Conference\",\"Mileage - Private Vehicle\",IF(ISBLANK(E33),\" \",))))","v":" "},null,null,null,null,null,null,{"$f":"SUM(Mileage[[#This Row],[Mileage]]*H3)","v":0}]
[null,null,null,null,null,{"$f":"(IF(Mileage[[#This Row],[Expense Label]]=\"Official Business\",\"Mileage - Official Business\",IF(Mileage[[#This Row],[Expense Label]]=\"Training/Conference\",\"Mileage - Private Vehicle\",IF(ISBLANK(E34),\" \",))))","v":" "},null,null,null,null,null,null,{"$f":"SUM(Mileage[[#This Row],[Mileage]]*H3)","v":0}]
[null,null,null,null,null,{"$f":"(IF(Mileage[[#This Row],[Expense Label]]=\"Official Business\",\"Mileage - Official Business\",IF(Mileage[[#This Row],[Expense Label]]=\"Training/Conference\",\"Mileage - Private Vehicle\",IF(ISBLANK(E35),\" \",))))","v":" "},null,null,null,null,null,null,{"$f":"SUM(Mileage[[#This Row],[Mileage]]*H3)","v":0}]
[null,null,null,null,null,{"$f":"(IF(Mileage[[#This Row],[Expense Label]]=\"Official Business\",\"Mileage - Official Business\",IF(Mileage[[#This Row],[Expense Label]]=\"Training/Conference\",\"Mileage - Private Vehicle\",IF(ISBLANK(E36),\" \",))))","v":" "},null,null,null,null,null,null,{"$f":"SUM(Mileage[[#This Row],[Mileage]]*H3)","v":0}]
[null,null,null,null,null,{"$f":"(IF(Mileage[[#This Row],[Expense Label]]=\"Official Business\",\"Mileage - Official Business\",IF(Mileage[[#This Row],[Expense Label]]=\"Training/Conference\",\"Mileage - Private Vehicle\",IF(ISBLANK(E37),\" \",))))","v":" "},null,null,null,null,null,null,{"$f":"SUM(Mileage[[#This Row],[Mileage]]*H3)","v":0}]
[null,null,null,null,null,{"$f":"(IF(Mileage[[#This Row],[Expense Label]]=\"Official Business\",\"Mileage - Official Business\",IF(Mileage[[#This Row],[Expense Label]]=\"Training/Conference\",\"Mileage - Private Vehicle\",IF(ISBLANK(E38),\" \",))))","v":" "},null,null,null,null,null,null,{"$f":"SUM(Mileage[[#This Row],[Mileage]]*H3)","v":0}]
[null,null,null,null,null,{"$f":"(IF(Mileage[[#This Row],[Expense Label]]=\"Official Business\",\"Mileage - Official Business\",IF(Mileage[[#This Row],[Expense Label]]=\"Training/Conference\",\"Mileage - Private Vehicle\",IF(ISBLANK(E39),\" \",))))","v":" "},null,null,null,null,null,null,{"$f":"SUM(Mileage[[#This Row],[Mileage]]*H3)","v":0}]
[null,null,null,null,null,{"$f":"(IF(Mileage[[#This Row],[Expense Label]]=\"Official Business\",\"Mileage - Official Business\",IF(Mileage[[#This Row],[Expense Label]]=\"Training/Conference\",\"Mileage - Private Vehicle\",IF(ISBLANK(E40),\" \",))))","v":" "},null,null,null,null,null,null,{"$f":"SUM(Mileage[[#This Row],[Mileage]]*H3)","v":0}]
[null,null,null,null,null,{"$f":"(IF(Mileage[[#This Row],[Expense Label]]=\"Official Business\",\"Mileage - Official Business\",IF(Mileage[[#This Row],[Expense Label]]=\"Training/Conference\",\"Mileage - Private Vehicle\",IF(ISBLANK(E41),\" \",))))","v":" "},null,null,null,null,null,null,{"$f":"SUM(Mileage[[#This Row],[Mileage]]*H3)","v":0}]
[null,null,null,null,null,{"$f":"(IF(Mileage[[#This Row],[Expense Label]]=\"Official Business\",\"Mileage - Official Business\",IF(Mileage[[#This Row],[Expense Label]]=\"Training/Conference\",\"Mileage - Private Vehicle\",IF(ISBLANK(E42),\" \",))))","v":" "},null,null,null,null,null,null,{"$f":"SUM(Mileage[[#This Row],[Mileage]]*H3)","v":0}]
[null,null,null,null,null,{"$f":"(IF(Mileage[[#This Row],[Expense Label]]=\"Official Business\",\"Mileage - Official Business\",IF(Mileage[[#This Row],[Expense Label]]=\"Training/Conference\",\"Mileage - Private Vehicle\",IF(ISBLANK(E43),\" \",))))","v":" "},null,null,null,null,null,null,{"$f":"SUM(Mileage[[#This Row],[Mileage]]*H3)","v":0}]
[null,null,null,null,null,{"$f":"(IF(Mileage[[#This Row],[Expense Label]]=\"Official Business\",\"Mileage - Official Business\",IF(Mileage[[#This Row],[Expense Label]]=\"Training/Conference\",\"Mileage - Private Vehicle\",IF(ISBLANK(E44),\" \",))))","v":" "},null,null,null,null,null,null,{"$f":"SUM(Mileage[[#This Row],[Mileage]]*H3)","v":0}]
[null,null,null,null,null,{"$f":"(IF(Mileage[[#This Row],[Expense Label]]=\"Official Business\",\"Mileage - Official Business\",IF(Mileage[[#This Row],[Expense Label]]=\"Training/Conference\",\"Mileage - Private Vehicle\",IF(ISBLANK(E45),\" \",))))","v":" "},null,null,null,null,null,null,{"$f":"SUM(Mileage[[#This Row],[Mileage]]*H3)","v":0}]
[null,null,null,null,null,{"$f":"(IF(Mileage[[#This Row],[Expense Label]]=\"Official Business\",\"Mileage - Official Business\",IF(Mileage[[#This Row],[Expense Label]]=\"Training/Conference\",\"Mileage - Private Vehicle\",IF(ISBLANK(E46),\" \",))))","v":" "},null,null,null,null,null,null,{"$f":"SUM(Mileage[[#This Row],[Mileage]]*H3)","v":0}]
[null,null,null,null,null,{"$f":"(IF(Mileage[[#This Row],[Expense Label]]=\"Official Business\",\"Mileage - Official Business\",IF(Mileage[[#This Row],[Expense Label]]=\"Training/Conference\",\"Mileage - Private Vehicle\",IF(ISBLANK(E47),\" \",))))","v":" "},null,null,null,null,null,null,{"$f":"SUM(Mileage[[#This Row],[Mileage]]*H3)","v":0}]
[null,null,null,null,null,{"$f":"(IF(Mileage[[#This Row],[Expense Label]]=\"Official Business\",\"Mileage - Official Business\",IF(Mileage[[#This Row],[Expense Label]]=\"Training/Conference\",\"Mileage - Private Vehicle\",IF(ISBLANK(E48),\" \",))))","v":" "},null,null,null,null,null,null,{"$f":"SUM(Mileage[[#This Row],[Mileage]]*H3)","v":0}]
[null,null,null,null,null,{"$f":"(IF(Mileage[[#This Row],[Expense Label]]=\"Official Business\",\"Mileage - Official Business\",IF(Mileage[[#This Row],[Expense Label]]=\"Training/Conference\",\"Mileage - Private Vehicle\",IF(ISBLANK(E49),\" \",))))","v":" "},null,null,null,null,null,null,{"$f":"SUM(Mileage[[#This Row],[Mileage]]*H3)","v":0}]
[null,null,null,null,null,{"$f":"(IF(Mileage[[#This Row],[Expense Label]]=\"Official Business\",\"Mileage - Official Business\",IF(Mileage[[#This Row],[Expense Label]]=\"Training/Conference\",\"Mileage - Private Vehicle\",IF(ISBLANK(E50),\" \",))))","v":" "},null,null,null,null,null,null,{"$f":"SUM(Mileage[[#This Row],[Mileage]]*H3)","v":0}]
[null,null,null,null,null,{"$f":"(IF(Mileage[[#This Row],[Expense Label]]=\"Official Business\",\"Mileage - Official Business\",IF(Mileage[[#This Row],[Expense Label]]=\"Training/Conference\",\"Mileage - Private Vehicle\",IF(ISBLANK(E51),\" \",))))","v":" "},null,null,null,null,null,null,{"$f":"SUM(Mileage[[#This Row],[Mileage]]*H3)","v":0}]
[null,null,null,null,null,{"$f":"(IF(Mileage[[#This Row],[Expense Label]]=\"Official Business\",\"Mileage - Official Business\",IF(Mileage[[#This Row],[Expense Label]]=\"Training/Conference\",\"Mileage - Private Vehicle\",IF(ISBLANK(E52),\" \",))))","v":" "},null,null,null,null,null,null,{"$f":"SUM(Mileage[[#This Row],[Mileage]]*H3)","v":0}]
[null,null,null,null,null,{"$f":"(IF(Mileage[[#This Row],[Expense Label]]=\"Official Business\",\"Mileage - Official Business\",IF(Mileage[[#This Row],[Expense Label]]=\"Training/Conference\",\"Mileage - Private Vehicle\",IF(ISBLANK(E53),\" \",))))","v":" "},null,null,null,null,null,null,{"$f":"SUM(Mileage[[#This Row],[Mileage]]*H3)","v":0}]
[null,null,null,null,null,{"$f":"(IF(Mileage[[#This Row],[Expense Label]]=\"Official Business\",\"Mileage - Official Business\",IF(Mileage[[#This Row],[Expense Label]]=\"Training/Conference\",\"Mileage - Private Vehicle\",IF(ISBLANK(E54),\" \",))))","v":" "},null,null,null,null,null,null,{"$f":"SUM(Mileage[[#This Row],[Mileage]]*H3)","v":0}]
[null,null,null,null,null,{"$f":"(IF(Mileage[[#This Row],[Expense Label]]=\"Official Business\",\"Mileage - Official Business\",IF(Mileage[[#This Row],[Expense Label]]=\"Training/Conference\",\"Mileage - Private Vehicle\",IF(ISBLANK(E55),\" \",))))","v":" "},null,null,null,null,null,null,{"$f":"SUM(Mileage[[#This Row],[Mileage]]*H3)","v":0}]
[null,null,null,null,null,{"$f":"(IF(Mileage[[#This Row],[Expense Label]]=\"Official Business\",\"Mileage - Official Business\",IF(Mileage[[#This Row],[Expense Label]]=\"Training/Conference\",\"Mileage - Private Vehicle\",IF(ISBLANK(E56),\" \",))))","v":" "},null,null,null,null,null,null,{"$f":"SUM(Mileage[[#This Row],[Mileage]]*H3)","v":0}]
[null,null,null,null,null,{"$f":"(IF(Mileage[[#This Row],[Expense Label]]=\"Official Business\",\"Mileage - Official Business\",IF(Mileage[[#This Row],[Expense Label]]=\"Training/Conference\",\"Mileage - Private Vehicle\",IF(ISBLANK(E57),\" \",))))","v":" "},null,null,null,null,null,null,{"$f":"SUM(Mileage[[#This Row],[Mileage]]*H3)","v":0}]
[null,null,null,null,null,{"$f":"(IF(Mileage[[#This Row],[Expense Label]]=\"Official Business\",\"Mileage - Official Business\",IF(Mileage[[#This Row],[Expense Label]]=\"Training/Conference\",\"Mileage - Private Vehicle\",IF(ISBLANK(E58),\" \",))))","v":" "},null,null,null,null,null,null,{"$f":"SUM(Mileage[[#This Row],[Mileage]]*H3)","v":0}]
[null,null,null,null,null,{"$f":"(IF(Mileage[[#This Row],[Expense Label]]=\"Official Business\",\"Mileage - Official Business\",IF(Mileage[[#This Row],[Expense Label]]=\"Training/Conference\",\"Mileage - Private Vehicle\",IF(ISBLANK(E59),\" \",))))","v":" "},null,null,null,null,null,null,{"$f":"SUM(Mileage[[#This Row],[Mileage]]*H3)","v":0}]
[null,null,null,null,null,{"$f":"(IF(Mileage[[#This Row],[Expense Label]]=\"Official Business\",\"Mileage - Official Business\",IF(Mileage[[#This Row],[Expense Label]]=\"Training/Conference\",\"Mileage - Private Vehicle\",IF(ISBLANK(E60),\" \",))))","v":" "},null,null,null,null,null,null,{"$f":"SUM(Mileage[[#This Row],[Mileage]]*H3)","v":0}]
{"$rows_left_out":243}
{"sheet":"Dropdown","index":2,"n_rows":3,"n_cols":1,"rows_kept":3,"cut":false,"hidden":true,"merged":[]}
["Expense Item Classification"]
["Official Business"]
["Training/Conference"]